{"text_format":"1","workbook":"xlsx","n_sheets":7,"sheets":["Intro","Annual Compliance ->","WAPC Inputs","WAPC Allowance","Compliance Summary","Regulatory Reset ->","X factor Setting"],"not_rendered":{"charts":0,"images":1,"macros":1,"external_links":3,"defined_names":25,"comments":3,"pivot_tables":0},"unopened":[],"bounds":{"document_bytes":16777216,"sheet_cells":100000,"rows_first":2000,"rows_last":500,"rows_between":2000,"halvings":0,"cell_chars":16384,"cell_head_chars":4096},"cells_cut":0,"cells_raw":0,"read":"whole","date_system":"1900"}

{"sheet":"Intro","index":0,"n_rows":14,"n_cols":3,"rows_kept":14,"cut":false,"hidden":false,"merged":[[0,0,0,22],[3,0,6,22],[9,3,10,19],[11,3,13,19],[14,3,16,19]]}
["nbn Weighted Average Price Control model"]
[]
[]
["\nThis document is a template model for applying the Weighted Average Price Control (WAPC) proposed in NBN Co’s SAU variation lodged with the ACCC in November 2022, where that WAPC is proposed to first apply in Financial Year 2024/25.  This document is provided solely for the purpose of assisting the ACCC in its assessment of that SAU variation, and should not be relied upon for any purpose not related to this regulatory process.  "]
[]
[]
[]
[null,"Public version"]
[]
[]
[null,"Cell colour meanings"]
[]
[null,null,"Input cell"]
[null,null,"Calculation cell"]

{"sheet":"Annual Compliance ->","index":1,"n_rows":0,"n_cols":0,"rows_kept":0,"cut":false,"hidden":false,"merged":[]}

{"sheet":"WAPC Inputs","index":2,"n_rows":464,"n_cols":9,"rows_kept":464,"cut":false,"hidden":false,"merged":[]}
[]
[null,"WAPC Compliance Inputs"]
[]
[null,"Model start financial year (t-1)"]
[null,"Actual December Quarter CPI"]
[]
[null,"Prices (Applying 1 July to 30 June)",null,{"$f":"$C$4","v":0},{"$f":"$D$7+1","v":1},null,"Applicable Individual Price Control","Proposed Tariff Change","Compliance Status"]
[null,"Tariff List","Category"]
[null,"AVC TC4 100/20 Mbps","Other TC-4",null,null,null,{"$f":"IFERROR(VLOOKUP(C9,'Compliance Summary'!$B$12:$C$16,2,0),\"n/a\")","v":"n/a"},{"$f":"IFERROR(E9/D9-1,\"n/a\")","v":"n/a"},{"$f":"IF(H9=\"n/a\",\"\",IF(H9<=G9,\"Compliant\",\"Not Compliant\"))","v":""}]
[null,"AVC TC4 100/40 Mbps","Other TC-4",null,null,null,{"$f":"IFERROR(VLOOKUP(C10,'Compliance Summary'!$B$12:$C$16,2,0),\"n/a\")","v":"n/a"},{"$f":"IFERROR(E10/D10-1,\"n/a\")","v":"n/a"},{"$f":"IF(H10=\"n/a\",\"\",IF(H10<=G10,\"Compliant\",\"Not Compliant\"))","v":""}]
[null,"AVC TC4 250/25 Mbps","Other TC-4",null,null,null,{"$f":"IFERROR(VLOOKUP(C11,'Compliance Summary'!$B$12:$C$16,2,0),\"n/a\")","v":"n/a"},"n/a",""]
[null,"AVC TC4 250/100 Mbps","Other TC-4",null,null,null,{"$f":"IFERROR(VLOOKUP(C12,'Compliance Summary'!$B$12:$C$16,2,0),\"n/a\")","v":"n/a"},"n/a",""]
[null,"AVC TC4 500/200 Mbps","Other TC-4",null,null,null,{"$f":"IFERROR(VLOOKUP(C13,'Compliance Summary'!$B$12:$C$16,2,0),\"n/a\")","v":"n/a"},"n/a",""]
[null,"AVC TC4 1000/50 Mbps","Other TC-4",null,null,null,{"$f":"IFERROR(VLOOKUP(C14,'Compliance Summary'!$B$12:$C$16,2,0),\"n/a\")","v":"n/a"},"n/a",""]
[null,"AVC TC4 1000/400 Mbps ","Other TC-4",null,null,null,{"$f":"IFERROR(VLOOKUP(C15,'Compliance Summary'!$B$12:$C$16,2,0),\"n/a\")","v":"n/a"},"n/a",""]
[null,"Smart Places - AVC TC4 100/20 Mbps","Other TC-4",null,null,null,{"$f":"IFERROR(VLOOKUP(C16,'Compliance Summary'!$B$12:$C$16,2,0),\"n/a\")","v":"n/a"},"n/a",""]
[null,"Smart Places - AVC TC4 100/40 Mbps","Other TC-4",null,null,null,{"$f":"IFERROR(VLOOKUP(C17,'Compliance Summary'!$B$12:$C$16,2,0),\"n/a\")","v":"n/a"},"n/a",""]
[null,"Smart Places - AVC TC4 250/25 Mbps","Other TC-4",null,null,null,{"$f":"IFERROR(VLOOKUP(C18,'Compliance Summary'!$B$12:$C$16,2,0),\"n/a\")","v":"n/a"},"n/a",""]
[null,"Smart Places - AVC TC4 250/100 Mbps","Other TC-4",null,null,null,{"$f":"IFERROR(VLOOKUP(C19,'Compliance Summary'!$B$12:$C$16,2,0),\"n/a\")","v":"n/a"},"n/a",""]
[null,"Smart Places - AVC TC4 500/200 Mbps","Other TC-4",null,null,null,{"$f":"IFERROR(VLOOKUP(C20,'Compliance Summary'!$B$12:$C$16,2,0),\"n/a\")","v":"n/a"},"n/a",""]
[null,"Smart Places - AVC TC4 1000/50 Mbps","Other TC-4",null,null,null,{"$f":"IFERROR(VLOOKUP(C21,'Compliance Summary'!$B$12:$C$16,2,0),\"n/a\")","v":"n/a"},"n/a",""]
[null,"Smart Places - AVC TC4 1000/400 Mbps ","Other TC-4",null,null,null,{"$f":"IFERROR(VLOOKUP(C22,'Compliance Summary'!$B$12:$C$16,2,0),\"n/a\")","v":"n/a"},"n/a",""]
[null,"AVC TC4 12/1 Voice Only Bundled Offer","Other TC-4",null,null,null,{"$f":"IFERROR(VLOOKUP(C23,'Compliance Summary'!$B$12:$C$16,2,0),\"n/a\")","v":"n/a"},"n/a",""]
[null,"AVC TC4 12/1 Mbps bundled","Other TC-4",null,null,null,{"$f":"IFERROR(VLOOKUP(C24,'Compliance Summary'!$B$12:$C$16,2,0),\"n/a\")","v":"n/a"},"n/a",""]
[null,"AVC TC4 25/5 Mbps bundled","Entry level TC-4",null,null,null,{"$f":"IFERROR(VLOOKUP(C25,'Compliance Summary'!$B$12:$C$16,2,0),\"n/a\")","v":0},"n/a",""]
[null,"AVC TC4 25/10 Mbps bundled","Other TC-4",null,null,null,{"$f":"IFERROR(VLOOKUP(C26,'Compliance Summary'!$B$12:$C$16,2,0),\"n/a\")","v":"n/a"},"n/a",""]
[null,"AVC TC4 50/20 Mbps bundled","Other TC-4",null,null,null,{"$f":"IFERROR(VLOOKUP(C27,'Compliance Summary'!$B$12:$C$16,2,0),\"n/a\")","v":"n/a"},"n/a",""]
[null,"AVC TC4 FW Plus bundled","Other TC-4",null,null,null,{"$f":"IFERROR(VLOOKUP(C28,'Compliance Summary'!$B$12:$C$16,2,0),\"n/a\")","v":"n/a"},"n/a",""]
[null,"Smart Places - AVC TC4 12/1 Voice Only Bundled Offer","Other TC-4",null,null,null,{"$f":"IFERROR(VLOOKUP(C29,'Compliance Summary'!$B$12:$C$16,2,0),\"n/a\")","v":"n/a"},"n/a",""]
[null,"Smart Places - AVC TC4 12/1 Mbps bundled","Other TC-4",null,null,null,{"$f":"IFERROR(VLOOKUP(C30,'Compliance Summary'!$B$12:$C$16,2,0),\"n/a\")","v":"n/a"},"n/a",""]
[null,"Smart Places - AVC TC4 25/5 Mbps bundled","Entry level TC-4",null,null,null,{"$f":"IFERROR(VLOOKUP(C31,'Compliance Summary'!$B$12:$C$16,2,0),\"n/a\")","v":0},"n/a",""]
[null,"Smart Places - AVC TC4 25/10 Mbps bundled","Other TC-4",null,null,null,{"$f":"IFERROR(VLOOKUP(C32,'Compliance Summary'!$B$12:$C$16,2,0),\"n/a\")","v":"n/a"},"n/a",""]
[null,"Smart Places - AVC TC4 50/20 Mbps bundled","Other TC-4",null,null,null,{"$f":"IFERROR(VLOOKUP(C33,'Compliance Summary'!$B$12:$C$16,2,0),\"n/a\")","v":"n/a"},"n/a",""]
[null,"Satellite AVC TC4 12/1 Mbps","Satellite AVC",null,null,null,{"$f":"IFERROR(VLOOKUP(C34,'Compliance Summary'!$B$12:$C$16,2,0),\"n/a\")","v":0},"n/a",""]
[null,"Satellite AVC TC4 25/5 Mbps","Satellite AVC",null,null,null,{"$f":"IFERROR(VLOOKUP(C35,'Compliance Summary'!$B$12:$C$16,2,0),\"n/a\")","v":0},"n/a",""]
[null,"Sky Muster Plus Bundle 25+","Other charges",null,null,null,{"$f":"IFERROR(VLOOKUP(C36,'Compliance Summary'!$B$12:$C$16,2,0),\"n/a\")","v":"n/a"},"n/a",""]
[null,"Sky Muster Plus Bundle 50+","Other charges",null,null,null,{"$f":"IFERROR(VLOOKUP(C37,'Compliance Summary'!$B$12:$C$16,2,0),\"n/a\")","v":"n/a"},"n/a",""]
[null,"Sky Muster Plus Bundle 100+","Other charges",null,null,null,{"$f":"IFERROR(VLOOKUP(C38,'Compliance Summary'!$B$12:$C$16,2,0),\"n/a\")","v":"n/a"},"n/a",""]
[null,"Sky Muster Plus Bundle 150","Other charges",null,null,null,{"$f":"IFERROR(VLOOKUP(C39,'Compliance Summary'!$B$12:$C$16,2,0),\"n/a\")","v":"n/a"},"n/a",""]
[null,"Sky Muster Plus $4/5GB Additional Data charge","Other charges",null,null,null,{"$f":"IFERROR(VLOOKUP(C40,'Compliance Summary'!$B$12:$C$16,2,0),\"n/a\")","v":"n/a"},"n/a",""]
[null,"Sky Muster Plus breach Charge NRC","Other charges",null,null,null,{"$f":"IFERROR(VLOOKUP(C41,'Compliance Summary'!$B$12:$C$16,2,0),\"n/a\")","v":"n/a"},"n/a",""]
[null,"AVC TC2 5/5 Mbps","Other charges",null,null,null,{"$f":"IFERROR(VLOOKUP(C42,'Compliance Summary'!$B$12:$C$16,2,0),\"n/a\")","v":"n/a"},"n/a",""]
[null,"AVC TC2 10/10 Mbps","Other charges",null,null,null,{"$f":"IFERROR(VLOOKUP(C43,'Compliance Summary'!$B$12:$C$16,2,0),\"n/a\")","v":"n/a"},"n/a",""]
[null,"AVC TC2 20/20 Mbps","Other charges",null,null,null,{"$f":"IFERROR(VLOOKUP(C44,'Compliance Summary'!$B$12:$C$16,2,0),\"n/a\")","v":"n/a"},"n/a",""]
[null,"AVC TC2 30/30 Mbps","Other charges",null,null,null,{"$f":"IFERROR(VLOOKUP(C45,'Compliance Summary'!$B$12:$C$16,2,0),\"n/a\")","v":"n/a"},"n/a",""]
[null,"AVC TC2 40/40 Mbps","Other charges",null,null,null,{"$f":"IFERROR(VLOOKUP(C46,'Compliance Summary'!$B$12:$C$16,2,0),\"n/a\")","v":"n/a"},"n/a",""]
[null,"AVC TC2 50/50 Mbps","Other charges",null,null,null,{"$f":"IFERROR(VLOOKUP(C47,'Compliance Summary'!$B$12:$C$16,2,0),\"n/a\")","v":"n/a"},"n/a",""]
[null,"AVC TC2 60/60 Mbps","Other charges",null,null,null,{"$f":"IFERROR(VLOOKUP(C48,'Compliance Summary'!$B$12:$C$16,2,0),\"n/a\")","v":"n/a"},"n/a",""]
[null,"AVC TC2 70/70 Mbps","Other charges",null,null,null,{"$f":"IFERROR(VLOOKUP(C49,'Compliance Summary'!$B$12:$C$16,2,0),\"n/a\")","v":"n/a"},"n/a",""]
[null,"AVC TC2 80/80 Mbps","Other charges",null,null,null,{"$f":"IFERROR(VLOOKUP(C50,'Compliance Summary'!$B$12:$C$16,2,0),\"n/a\")","v":"n/a"},"n/a",""]
[null,"AVC TC2 90/90 Mbps","Other charges",null,null,null,{"$f":"IFERROR(VLOOKUP(C51,'Compliance Summary'!$B$12:$C$16,2,0),\"n/a\")","v":"n/a"},"n/a",""]
[null,"AVC TC2 100/100 Mbps","Other charges",null,null,null,{"$f":"IFERROR(VLOOKUP(C52,'Compliance Summary'!$B$12:$C$16,2,0),\"n/a\")","v":"n/a"},"n/a",""]
[null,"Smart Places - AVC TC2 5/5 Mbps","Other charges",null,null,null,{"$f":"IFERROR(VLOOKUP(C53,'Compliance Summary'!$B$12:$C$16,2,0),\"n/a\")","v":"n/a"},"n/a",""]
[null,"Smart Places  - AVC TC2 10/10 Mbps","Other charges",null,null,null,{"$f":"IFERROR(VLOOKUP(C54,'Compliance Summary'!$B$12:$C$16,2,0),\"n/a\")","v":"n/a"},"n/a",""]
[null,"Smart Places - AVC TC2 20/20 Mbps","Other charges",null,null,null,{"$f":"IFERROR(VLOOKUP(C55,'Compliance Summary'!$B$12:$C$16,2,0),\"n/a\")","v":"n/a"},"n/a",""]
[null,"Smart Places - AVC TC2 30/30 Mbps","Other charges",null,null,null,{"$f":"IFERROR(VLOOKUP(C56,'Compliance Summary'!$B$12:$C$16,2,0),\"n/a\")","v":"n/a"},"n/a",""]
[null,"Smart Places  - AVC TC2 40/40 Mbps","Other charges",null,null,null,{"$f":"IFERROR(VLOOKUP(C57,'Compliance Summary'!$B$12:$C$16,2,0),\"n/a\")","v":"n/a"},"n/a",""]
[null,"Smart Places - AVC TC2 50/50 Mbps","Other charges",null,null,null,{"$f":"IFERROR(VLOOKUP(C58,'Compliance Summary'!$B$12:$C$16,2,0),\"n/a\")","v":"n/a"},"n/a",""]
[null,"Smart Places - AVC TC2 60/60 Mbps","Other charges",null,null,null,{"$f":"IFERROR(VLOOKUP(C59,'Compliance Summary'!$B$12:$C$16,2,0),\"n/a\")","v":"n/a"},"n/a",""]
[null,"Smart Places - AVC TC2 70/70 Mbps","Other charges",null,null,null,{"$f":"IFERROR(VLOOKUP(C60,'Compliance Summary'!$B$12:$C$16,2,0),\"n/a\")","v":"n/a"},"n/a",""]
{"$rows_left_out":405}
{"sheet":"WAPC Allowance","index":3,"n_rows":41,"n_cols":6,"rows_kept":41,"cut":false,"hidden":false,"merged":[]}
[]
[null,"WAPC Allowance Calculations"]
[]
[null,"Regulatory Start Financial Year"]
[null,"Phase (select)"]
[]
[null,"WAPC Allowance",{"$f":"D7-1","v":-1},{"$f":"$C$4","v":0},{"$f":"D7+1","v":1},{"$f":"E7+1","v":2}]
[]
[null,"Forecast December CPI"]
[]
[null,"X factor",null,{"$f":"IF($C$5=\"CPI Constraint\",0,'X factor Setting'!E$8)","v":0},{"$f":"IF($C$5=\"CPI Constraint\",0,'X factor Setting'!F$8)","v":""},{"$f":"IF($C$5=\"CPI Constraint\",0,'X factor Setting'!G$8)","v":""}]
[null,"Cost pass through adjustment factor",null,{"$f":"'WAPC Allowance'!D29","v":0},{"$f":"'WAPC Allowance'!E29","v":0},{"$f":"'WAPC Allowance'!F29","v":0}]
[null,"Excess adjustment factor (EM)",null,{"$f":"'WAPC Allowance'!D41","v":0},{"$f":"'WAPC Allowance'!E41","v":0},{"$f":"'WAPC Allowance'!F41","v":0}]
[]
[null,"WAPC Allowance",null,{"$f":"(1+D9)*(1-D11)*(1+D12)*(1+D13)-1","v":0},{"$f":"(1+E9)*(1-E11)*(1+E12)*(1+E13)-1","v":{"$error":"#VALUE!"}},{"$f":"(1+F9)*(1-F11)*(1+F12)*(1+F13)-1","v":{"$error":"#VALUE!"}}]
[]
[null,"Cost pass-through factor",{"$f":"'WAPC Allowance'!C7","v":-1},{"$f":"'WAPC Allowance'!D7","v":0},{"$f":"'WAPC Allowance'!E7","v":1},{"$f":"'WAPC Allowance'!F7","v":2}]
[]
[null,"Inputs"]
[null,"Cost pass through in previous year",null,null,{"$f":"D27","v":0},{"$f":"E27","v":0}]
[]
[null,"Pass-through amount approved by ACCC"]
[null,"CPI",null,{"$f":"INDEX('WAPC Allowance'!$D$9:$F$9,,MATCH('WAPC Allowance'!D17,'WAPC Allowance'!$D$7:$F$7,0))","v":0},{"$f":"INDEX('WAPC Allowance'!$D$9:$F$9,,MATCH('WAPC Allowance'!E17,'WAPC Allowance'!$D$7:$F$7,0))","v":0},{"$f":"INDEX('WAPC Allowance'!$D$9:$F$9,,MATCH('WAPC Allowance'!F17,'WAPC Allowance'!$D$7:$F$7,0))","v":0}]
[null,"X factor",null,{"$f":"INDEX('WAPC Allowance'!$D$11:$F$11,,MATCH('WAPC Allowance'!D17,'WAPC Allowance'!$D$7:$F$7,0))","v":0},{"$f":"INDEX('WAPC Allowance'!$D$11:$F$11,,MATCH('WAPC Allowance'!E17,'WAPC Allowance'!$D$7:$F$7,0))","v":""},{"$f":"INDEX('WAPC Allowance'!$D$11:$F$11,,MATCH('WAPC Allowance'!F17,'WAPC Allowance'!$D$7:$F$7,0))","v":""}]
[null,"Excess adjustment factor",null,{"$f":"D41","v":0},{"$f":"E41","v":0},{"$f":"F41","v":0}]
[null,"Notional Revenue In Prior Year "]
[null,"Pass through in current year",null,{"$f":"IFERROR(D22/((1+D23)*(1-D24)*(1+D25)*D26),0)","v":0},{"$f":"IFERROR(E22/((1+E23)*(1-E24)*(1+E25)*E26),0)","v":0},{"$f":"IFERROR(F22/((1+F23)*(1-F24)*(1+F25)*F26),0)","v":0}]
[]
[null,"Cost pass-through adjustment factor (PT)",null,{"$f":"(1+D27)/(1+D20)-1","v":0},{"$f":"(1+E27)/(1+E20)-1","v":0},{"$f":"(1+F27)/(1+F20)-1","v":0}]
[]
[null,"Excess adjustment",{"$f":"C17","v":-1},0,1,2]
[]
[null,"Inputs"]
[null,"CPI t-2",null,null,null,{"$f":"D23","v":0}]
[null,"X factor t-2",null,null,null,{"$f":"D24","v":0}]
[null,"Pass through t-2",null,null,null,{"$f":"D29","v":0}]
[null,"Excess adjustment t-2"]
[]
[null,"WAP Ratio t-2",null,null,null,1]
[]
[null,"Excess adjustment factor (EM)",null,null,null,{"$f":"MIN(0,((1+F34)*(1-F35)*(1+F36)*(1+F37))/F39-1)","v":0}]

{"sheet":"Compliance Summary","index":4,"n_rows":38,"n_cols":3,"rows_kept":38,"cut":false,"hidden":false,"merged":[]}
[]
[null,"WAPC Compliance Summary"]
[null,"Note - sheet provided for completeness and is not relevant until 2024/25. Labels for price controls are a simplified representation of the detail in the SAU. Users should refer to Schedule 2D and 2E in the SAU submitted 29 November 2022 for specific price controls and calculations."]
[]
[null,"Applicable Financial Year for Proposed Tariff List"]
[]
[null,"Applicable Price Controls"]
[null,null,"Constraint"]
[null,"Weighted Average Price Cap (WAPC)",{"$f":"HLOOKUP('Compliance Summary'!$C$5,'WAPC Allowance'!$C$7:$F$15,9,0)","v":0}]
[]
[null,"Individual Price Controls"]
[null,"Entry level TC-4",{"$f":"'WAPC Inputs'!$C$5","v":0}]
[null,"Other TC-4 (non-Entry Level TC-4)",{"$f":"MAX('WAPC Inputs'!$C$5,5%)","v":0.05}]
[null,"Satellite AVC",{"$f":"'WAPC Inputs'!$C$5","v":0}]
[null,"Satellite CVC",0]
[]
[]
[null,"Tariff List Proposal"]
[]
[null,"WAPC Change",{"$f":"IFERROR(SUMPRODUCT('WAPC Inputs'!$E$9:$E$233,'WAPC Inputs'!$D$240:$D$464)/SUMPRODUCT('WAPC Inputs'!$D$9:$D$233,'WAPC Inputs'!$D$240:$D$464)-1, \"\")","v":""}]
[]
[null,"Maxmium Individual Price Change"]
[null,"Entry level TC-4",{"$f":"_xlfn.MAXIFS('WAPC Inputs'!$H$9:$H$233,'WAPC Inputs'!$C$9:$C$233,'Compliance Summary'!$B23)","v":0}]
[null,"Other TC-4 (non-Entry Level TC-4)",{"$f":"_xlfn.MAXIFS('WAPC Inputs'!$H$9:$H$233,'WAPC Inputs'!$C$9:$C$233,'Compliance Summary'!$B24)","v":0}]
[null,"Satellite AVC",{"$f":"_xlfn.MAXIFS('WAPC Inputs'!$H$9:$H$233,'WAPC Inputs'!$C$9:$C$233,'Compliance Summary'!$B25)","v":0}]
[null,"Satellite CVC",{"$f":"_xlfn.MAXIFS('WAPC Inputs'!$H$9:$H$233,'WAPC Inputs'!$C$9:$C$233,'Compliance Summary'!$B26)","v":0}]
[null,"Other charges",{"$f":"_xlfn.MAXIFS('WAPC Inputs'!$H$9:$H$233,'WAPC Inputs'!$C$9:$C$233,'Compliance Summary'!$B27)","v":0}]
[]
[null,"Compliance check"]
[]
[null,"Weighted Average Price Cap (WAPC)",{"$f":"IF(C20=\"\", \"\", IF(C20<=C9,\"Compliant\",\"Not Compliant\"))","v":""}]
[]
[null,"Individual Price Controls"]
[null,"Entry level TC-4",{"$f":"IF('WAPC Inputs'!C5=\"\",\"\",IF(C23<=C12,\"Compliant\",\"Not Compliant\"))","v":""}]
[null,"Other TC-4",{"$f":"IF('WAPC Inputs'!C5=\"\",\"\",IF(C24<=C13,\"Compliant\",\"Not Compliant\"))","v":""}]
[null,"Satellite AVC",{"$f":"IF('WAPC Inputs'!C5=\"\",\"\",IF(C25<=C14,\"Compliant\",\"Not Compliant\"))","v":""}]
[null,"Satellite CVC",{"$f":"IF('WAPC Inputs'!C5=\"\",\"\",IF(C26<=C15,\"Compliant\",\"Not Compliant\"))","v":""}]
[null,"Other charges",{"$f":"IF('WAPC Inputs'!C5=\"\",\"\",IF(C27<=C16,\"Compliant\",\"Not Compliant\"))","v":""}]

{"sheet":"Regulatory Reset ->","index":5,"n_rows":0,"n_cols":0,"rows_kept":0,"cut":false,"hidden":false,"merged":[]}

{"sheet":"X factor Setting","index":6,"n_rows":484,"n_cols":7,"rows_kept":484,"cut":false,"hidden":false,"merged":[]}
[]
[null,"X Factor Setting"]
[]
[null,"Regulatory Start Financial Year"]
[]
[null,"X-Factor Setting",null,{"$f":"E6-1","v":-1},{"$f":"$C$4","v":0},{"$f":"E6+1","v":1},{"$f":"F6+1","v":2}]
[]
[null,null,null,null,null,{"$f":"IF(E8=\"\",\"\",E8)","v":""},{"$f":"F8","v":""}]
[]
[null,"Smoothed WAPC Revenue"]
[null,"Smoothed Annual WAPC Revenue",null,null,{"$f":"SUMPRODUCT(E$30:E$254,E$260:E$484)","v":0},{"$f":"SUMPRODUCT(F$30:F$254,F$260:F$484)","v":0},0]
[null,"Smoothed Annual WAPC Revenue - NPV",null,{"$f":"E11/E$20+F11/F$20+G11/G$20","v":0}]
[null,"NPV Delta",null,{"$f":"D12-D24","v":0}]
[]
[null,"Building Block Inputs",null,{"$f":"E15-1","v":-1},{"$f":"$C$4","v":0},{"$f":"E15+1","v":1},{"$f":"F15+1","v":2}]
[]
[null,"Forecast December CPI"]
[]
[null,"WACC"]
[null,"Cumulative Discount Rate",null,1,{"$f":"D20*(1+E19)","v":1},{"$f":"E20*(1+F19)","v":1},1]
[]
[null,"Revenue Requirement"]
[null,"Annual WAPC Revenue Requirement"]
[null,"Annual WAPC Revenue Requirement - NPV",null,{"$f":"E23/E$20+F23/F$20+G23/G$20","v":0}]
[]
[]
[null,"Demand Forecasts (Annualised Demand Volumes from 1 July to 30 June)",null,{"$f":"E27-1","v":-1},{"$f":"$C$4","v":0},{"$f":"E27+1","v":1},{"$f":"F27+1","v":2}]
[]
[null,"Tariff List","Category"]
[null,{"$f":"'WAPC Inputs'!B9","v":"AVC TC4 100/20 Mbps"},{"$f":"'WAPC Inputs'!C9","v":"Other TC-4"}]
[null,{"$f":"'WAPC Inputs'!B10","v":"AVC TC4 100/40 Mbps"},{"$f":"'WAPC Inputs'!C10","v":"Other TC-4"}]
[null,{"$f":"'WAPC Inputs'!B11","v":"AVC TC4 250/25 Mbps"},{"$f":"'WAPC Inputs'!C11","v":"Other TC-4"}]
[null,{"$f":"'WAPC Inputs'!B12","v":"AVC TC4 250/100 Mbps"},{"$f":"'WAPC Inputs'!C12","v":"Other TC-4"}]
[null,{"$f":"'WAPC Inputs'!B13","v":"AVC TC4 500/200 Mbps"},{"$f":"'WAPC Inputs'!C13","v":"Other TC-4"}]
[null,{"$f":"'WAPC Inputs'!B14","v":"AVC TC4 1000/50 Mbps"},{"$f":"'WAPC Inputs'!C14","v":"Other TC-4"}]
[null,{"$f":"'WAPC Inputs'!B15","v":"AVC TC4 1000/400 Mbps "},{"$f":"'WAPC Inputs'!C15","v":"Other TC-4"}]
[null,{"$f":"'WAPC Inputs'!B16","v":"Smart Places - AVC TC4 100/20 Mbps"},{"$f":"'WAPC Inputs'!C16","v":"Other TC-4"}]
[null,{"$f":"'WAPC Inputs'!B17","v":"Smart Places - AVC TC4 100/40 Mbps"},{"$f":"'WAPC Inputs'!C17","v":"Other TC-4"}]
[null,{"$f":"'WAPC Inputs'!B18","v":"Smart Places - AVC TC4 250/25 Mbps"},{"$f":"'WAPC Inputs'!C18","v":"Other TC-4"}]
[null,{"$f":"'WAPC Inputs'!B19","v":"Smart Places - AVC TC4 250/100 Mbps"},{"$f":"'WAPC Inputs'!C19","v":"Other TC-4"}]
[null,{"$f":"'WAPC Inputs'!B20","v":"Smart Places - AVC TC4 500/200 Mbps"},{"$f":"'WAPC Inputs'!C20","v":"Other TC-4"}]
[null,{"$f":"'WAPC Inputs'!B21","v":"Smart Places - AVC TC4 1000/50 Mbps"},{"$f":"'WAPC Inputs'!C21","v":"Other TC-4"}]
[null,{"$f":"'WAPC Inputs'!B22","v":"Smart Places - AVC TC4 1000/400 Mbps "},{"$f":"'WAPC Inputs'!C22","v":"Other TC-4"}]
[null,{"$f":"'WAPC Inputs'!B23","v":"AVC TC4 12/1 Voice Only Bundled Offer"},{"$f":"'WAPC Inputs'!C23","v":"Other TC-4"}]
[null,{"$f":"'WAPC Inputs'!B24","v":"AVC TC4 12/1 Mbps bundled"},{"$f":"'WAPC Inputs'!C24","v":"Other TC-4"}]
[null,{"$f":"'WAPC Inputs'!B25","v":"AVC TC4 25/5 Mbps bundled"},{"$f":"'WAPC Inputs'!C25","v":"Entry level TC-4"}]
[null,{"$f":"'WAPC Inputs'!B26","v":"AVC TC4 25/10 Mbps bundled"},{"$f":"'WAPC Inputs'!C26","v":"Other TC-4"}]
[null,{"$f":"'WAPC Inputs'!B27","v":"AVC TC4 50/20 Mbps bundled"},{"$f":"'WAPC Inputs'!C27","v":"Other TC-4"}]
[null,{"$f":"'WAPC Inputs'!B28","v":"AVC TC4 FW Plus bundled"},{"$f":"'WAPC Inputs'!C28","v":"Other TC-4"}]
[null,{"$f":"'WAPC Inputs'!B29","v":"Smart Places - AVC TC4 12/1 Voice Only Bundled Offer"},{"$f":"'WAPC Inputs'!C29","v":"Other TC-4"}]
[null,{"$f":"'WAPC Inputs'!B30","v":"Smart Places - AVC TC4 12/1 Mbps bundled"},{"$f":"'WAPC Inputs'!C30","v":"Other TC-4"}]
[null,{"$f":"'WAPC Inputs'!B31","v":"Smart Places - AVC TC4 25/5 Mbps bundled"},{"$f":"'WAPC Inputs'!C31","v":"Entry level TC-4"}]
[null,{"$f":"'WAPC Inputs'!B32","v":"Smart Places - AVC TC4 25/10 Mbps bundled"},{"$f":"'WAPC Inputs'!C32","v":"Other TC-4"}]
[null,{"$f":"'WAPC Inputs'!B33","v":"Smart Places - AVC TC4 50/20 Mbps bundled"},{"$f":"'WAPC Inputs'!C33","v":"Other TC-4"}]
[null,{"$f":"'WAPC Inputs'!B34","v":"Satellite AVC TC4 12/1 Mbps"},{"$f":"'WAPC Inputs'!C34","v":"Satellite AVC"}]
[null,{"$f":"'WAPC Inputs'!B35","v":"Satellite AVC TC4 25/5 Mbps"},{"$f":"'WAPC Inputs'!C35","v":"Satellite AVC"}]
[null,{"$f":"'WAPC Inputs'!B36","v":"Sky Muster Plus Bundle 25+"},{"$f":"'WAPC Inputs'!C36","v":"Other charges"}]
[null,{"$f":"'WAPC Inputs'!B37","v":"Sky Muster Plus Bundle 50+"},{"$f":"'WAPC Inputs'!C37","v":"Other charges"}]
[null,{"$f":"'WAPC Inputs'!B38","v":"Sky Muster Plus Bundle 100+"},{"$f":"'WAPC Inputs'!C38","v":"Other charges"}]
[null,{"$f":"'WAPC Inputs'!B39","v":"Sky Muster Plus Bundle 150"},{"$f":"'WAPC Inputs'!C39","v":"Other charges"}]
{"$rows_left_out":424}